Unit test failure for quarkus-ecosystem-ci, Quarkus master commit 72a6ff10cfe7b6fe7f8a6a68e0979f39f1b8288a

Description

Observed by quarkus-ecosystem-ci running against Quarkus master with commit hash 72a6ff10cfe7b6fe7f8a6a68e0979f39f1b8288a

2020-05-14T05:17:14.2585458Z [ERROR] Tests run: 1, Failures: 1, Errors: 0, Skipped: 0, Time elapsed: 1.747 s <<< FAILURE! - in com.datastax.oss.quarkus.runtime.health.CassandraHealthBuildItemEnabledTest
2020-05-14T05:17:14.2731307Z [ERROR] com.datastax.oss.quarkus.runtime.health.CassandraHealthBuildItemEnabledTest.shouldHaveHealthCheckInTheContainer Time elapsed: 0.082 s <<< FAILURE!
2020-05-14T05:17:14.2734631Z org.opentest4j.AssertionFailedError:
2020-05-14T05:17:14.2735900Z
2020-05-14T05:17:14.2737369Z Expecting:
2020-05-14T05:17:14.2738511Z <0>
2020-05-14T05:17:14.2740978Z to be equal to:
2020-05-14T05:17:14.2742367Z <1>
2020-05-14T05:17:14.2743906Z but was not.
2020-05-14T05:17:14.2755277Z at com.datastax.oss.quarkus.runtime.health.CassandraHealthBuildItemEnabledTest.shouldHaveHealthCheckInTheContainer(CassandraHealthBuildItemEnabledTest.java:41)

Environment

None

Pull Requests

None

Assignee

Bret McGuire

Reporter

Bret McGuire

Labels

PM Priority

None

Affects versions

None

Fix versions

None

Pull Request

None

Doc Impact

None

Size

None

External issue ID

None

External issue ID

None

Epic Link

Priority

Major
Configure