Integration test failure for quarkus-ecosystem-ci, Quarkus master commit 72a6ff10cfe7b6fe7f8a6a68e0979f39f1b8288a

Description

Noted on a local branch against master (commit 72a6ff10cfe7b6fe7f8a6a68e0979f39f1b8288a) with already applied. The unit tests pass in this case but now we get the following IT failure:

2020-05-14 16:44:50,778 INFO [io.quarkus] (main) Quarkus 999-SNAPSHOT started in 30.517s. Listening on: http://0.0.0.0:8081
2020-05-14 16:44:50,779 INFO [io.quarkus] (main) Profile test activated.
2020-05-14 16:44:50,779 INFO [io.quarkus] (main) Installed features: [cassandra-client, cdi, resteasy, smallrye-health]
[ERROR] Tests run: 1, Failures: 0, Errors: 1, Skipped: 0, Time elapsed: 35.1 s <<< FAILURE! - in com.datastax.oss.quarkus.CassandraHealthCheckIT
[ERROR] com.datastax.oss.quarkus.CassandraHealthCheckIT.healthCheckShouldReportStatusUp Time elapsed: 0.643 s <<< ERROR!
java.lang.AbstractMethodError: io.restassured.internal.ResponseParserRegistrar.getProperty(Ljava/lang/StringLjava/lang/Object;
at com.datastax.oss.quarkus.CassandraHealthCheckIT.healthCheckShouldReportStatusUp(CassandraHealthCheckIT.java:36)

[INFO] Running com.datastax.oss.quarkus.ProductResourceIT
[ERROR] Tests run: 2, Failures: 0, Errors: 2, Skipped: 0, Time elapsed: 0.02 s <<< FAILURE! - in com.datastax.oss.quarkus.ProductResourceIT
[ERROR] com.datastax.oss.quarkus.ProductResourceIT.testSaveAndRetrieveProduct Time elapsed: 0.002 s <<< ERROR!
java.lang.AbstractMethodError: io.restassured.internal.ResponseParserRegistrar.getProperty(Ljava/lang/StringLjava/lang/Object;
at com.datastax.oss.quarkus.ProductResourceIT.testSaveAndRetrieveProduct(ProductResourceIT.java:33)

[ERROR] com.datastax.oss.quarkus.ProductResourceIT.shouldSaveAndRetrieveUsingCustomNameConverterThatUsesReflection Time elapsed: 0.003 s <<< ERROR!
java.lang.AbstractMethodError: io.restassured.internal.ResponseParserRegistrar.getProperty(Ljava/lang/StringLjava/lang/Object;
at com.datastax.oss.quarkus.ProductResourceIT.shouldSaveAndRetrieveUsingCustomNameConverterThatUsesReflection(ProductResourceIT.java:62)

2020-05-14 16:44:51,558 INFO [io.quarkus] (main) Quarkus stopped in 0.050s
[INFO]
[INFO] Results:
[INFO]
[ERROR] Errors:
[ERROR] CassandraHealthCheckIT.healthCheckShouldReportStatusUp:36 » AbstractMethod io....
[ERROR] ProductResourceIT.shouldSaveAndRetrieveUsingCustomNameConverterThatUsesReflection:62 » AbstractMethod
[ERROR] ProductResourceIT.testSaveAndRetrieveProduct:33 » AbstractMethod io.restassure...
[INFO]
[ERROR] Tests run: 3, Failures: 0, Errors: 3, Skipped: 0

Looks to be a break in the linkage between REST-assured code and the Quarkus test framework

Environment

None

Pull Requests

None

Assignee

Bret McGuire

Reporter

Bret McGuire

Labels

PM Priority

None

Affects versions

None

Fix versions

None

Pull Request

None

Doc Impact

None

Size

None

External issue ID

None

External issue ID

None

Epic Link

Priority

Major
Configure